Target
M1 family aminopeptidase
Ligand
BDBM50062474
Substrate
Meas. Tech.
ChEMBL_428661 (CHEMBL915808)
IC50
125±n/a nM
Citation
 Flipo, MBeghyn, TLeroux, VFlorent, IDeprez, BPDeprez-Poulain, RF Novel selective inhibitors of the zinc plasmodial aminopeptidase PfA-M1 as potential antimalarial agents. J Med Chem 50:1322-34 (2007)  
Target
Name:
M1 family aminopeptidase
Synonyms:
AMPN_PLAF7 Zinc aminopeptidase | m1-family aminopeptidase
Type:
PROTEIN
Mol. Mass.:
126072.31
Organism:
Plasmodium falciparum (isolate FcB1 / Columbia)
Description:
ChEMBL_735637
Residue:
1085
  
Inhibitor
Name:
BDBM50062474
Synonyms:
2,N-Dibenzyl-N'-hydroxy-malonamide CHEMBL113827 | N1,2-dibenzyl-N3-hydroxymalonamide
Type:
Small organic molecule
Emp. Form.:
C17H18N2O3
Mol. Mass.:
298.3364
SMILES:
ONC(=O)C(Cc1ccccc1)C(=O)NCc1ccccc1
: