Target
Replicase polyprotein 1a
Ligand
BDBM50208938
Substrate
Meas. Tech.
ChEMBL_429518 (CHEMBL918059)
IC50
270±n/a nM
Citation
 Zhang, JPettersson, HIHuitema, CNiu, CYin, JJames, MNEltis, LDVederas, JC Design, synthesis, and evaluation of inhibitors for severe acute respiratory syndrome 3C-like protease based on phthalhydrazide ketones or heteroaromatic esters. J Med Chem 50:1850-64 (2007)  
Target
Name:
Replicase polyprotein 1a
Synonyms:
3C-like proteinase 3CLp Growth factor-like peptide Non-structural protein 1 Non-structural protein 11 Non-structural protein 3 Non-structural protein 6 Non-structural protein 8 ORF1a polyprotein PL2-PRO Papain-like proteinase Replicase polyprotein 1a SARS coronavirus 3C-like proteinase nsp1 nsp11 nsp3 nsp5 nsp7 nsp9 pp1a
Type:
Enzyme
Mol. Mass.:
486353.36
Organism:
Human SARS coronavirus (SARS-CoV)
Description:
P0C6U8
Residue:
4382
  
Inhibitor
Name:
BDBM50208938
Synonyms:
5-chloropyridin-3-yl thiazole-4-carboxylate CHEMBL222628 | acs.jmedchem.1c00409_ST.133
Type:
Small organic molecule
Emp. Form.:
C9H5ClN2O2S
Mol. Mass.:
240.666
SMILES:
Clc1cncc(OC(=O)c2cscn2)c1
: