Target
Replicase polyprotein 1a
Ligand
BDBM50208942
Substrate
Meas. Tech.
ChEMBL_429518 (CHEMBL918059)
IC50
63±n/a nM
Citation
 Zhang, JPettersson, HIHuitema, CNiu, CYin, JJames, MNEltis, LDVederas, JC Design, synthesis, and evaluation of inhibitors for severe acute respiratory syndrome 3C-like protease based on phthalhydrazide ketones or heteroaromatic esters. J Med Chem 50:1850-64 (2007)  
Target
Name:
Replicase polyprotein 1a
Synonyms:
3C-like proteinase 3CLp Growth factor-like peptide Non-structural protein 1 Non-structural protein 11 Non-structural protein 3 Non-structural protein 6 Non-structural protein 8 ORF1a polyprotein PL2-PRO Papain-like proteinase Replicase polyprotein 1a SARS coronavirus 3C-like proteinase nsp1 nsp11 nsp3 nsp5 nsp7 nsp9 pp1a
Type:
Enzyme
Mol. Mass.:
486353.36
Organism:
Human SARS coronavirus (SARS-CoV)
Description:
P0C6U8
Residue:
4382
  
Inhibitor
Name:
BDBM50208942
Synonyms:
5-chloropyridin-3-yl 5-(4-chlorophenyl)furan-2-carboxylate CHEMBL222769 med.21724, Compound 95
Type:
Small organic molecule
Emp. Form.:
C16H9Cl2NO3
Mol. Mass.:
334.154
SMILES:
Clc1ccc(cc1)-c1ccc(o1)C(=O)Oc1cncc(Cl)c1
: