Target
Macrophage migration inhibitory factor
Ligand
BDBM50209081
Substrate
Meas. Tech.
ChEMBL_429520 (CHEMBL918061)
IC50
220±n/a nM
Citation
 Dabideen, DRCheng, KFAljabari, BMiller, EJPavlov, VAAl-Abed, Y Phenolic hydrazones are potent inhibitors of macrophage migration inhibitory factor proinflammatory activity and survival improving agents in sepsis. J Med Chem 50:1993-7 (2007)  
Target
Name:
Macrophage migration inhibitory factor
Synonyms:
GIF Glycosylation-inhibiting factor L-dopachrome tautomerase MIF/CD74 (Macrophage migration inhibitory factor and HLA-DR antigens-associated invariant chain) MMIF Macrophage migration inhibitory factor (MIF) | Phenylpyruvate tautomerase
Type:
Enzyme
Mol. Mass.:
12478.18
Organism:
Homo sapiens (Human)
Description:
P14174
Residue:
115
  
Inhibitor
Name:
BDBM50209081
Synonyms:
3-chloro-4-hydroxybenzaldehyde (4-methoxyphenyl)hydrazone | CHEMBL223319
Type:
Small organic molecule
Emp. Form.:
C14H13ClN2O2
Mol. Mass.:
276.718
SMILES:
COc1ccc(cc1)N=NCc1ccc(O)c(Cl)c1
: