Target
Sodium-dependent dopamine transporter
Ligand
BDBM50209168
Substrate
Meas. Tech.
ChEMBL_443464 (CHEMBL893722)
IC50
290±n/a nM
Citation
 Deskus, JAEpperson, JRSloan, CPCipollina, JADextraze, PQian-Cutrone, JGao, QMa, BBeno, BRMattson, GKMolski, TFKrause, RGTaber, MTLodge, NJMattson, RJ Conformationally restricted homotryptamines 3. Indole tetrahydropyridines and cyclohexenylamines as selective serotonin reuptake inhibitors. Bioorg Med Chem Lett 17:3099-104 (2007)  
Target
Name:
Sodium-dependent dopamine transporter
Synonyms:
DA transporter DAT1 Dopamine transporter protein (DAT) SC6A3_HUMAN Sodium-dependent dopamine transporter Solute carrier family 6 member 3
Type:
Multi-pass membrane protein
Mol. Mass.:
68497.11
Organism:
Homo sapiens (Human)
Description:
Q01959
Residue:
620
  
Inhibitor
Name:
BDBM50209168
Synonyms:
(R)-3-(4-(dimethylamino)cyclohex-1-enyl)-1H-indole-5-carbonitrile | CHEMBL234706
Type:
Small organic molecule
Emp. Form.:
C17H19N3
Mol. Mass.:
265.3529
SMILES:
CN(C)[C@@H]1CCC(=CC1)c1c[nH]c2ccc(cc12)C#N
: