Target
Sodium-dependent noradrenaline transporter
Ligand
BDBM50209172
Substrate
Meas. Tech.
ChEMBL_443465 (CHEMBL893723)
IC50
37±n/a nM
Citation
 Deskus, JAEpperson, JRSloan, CPCipollina, JADextraze, PQian-Cutrone, JGao, QMa, BBeno, BRMattson, GKMolski, TFKrause, RGTaber, MTLodge, NJMattson, RJ Conformationally restricted homotryptamines 3. Indole tetrahydropyridines and cyclohexenylamines as selective serotonin reuptake inhibitors. Bioorg Med Chem Lett 17:3099-104 (2007)  
Target
Name:
Sodium-dependent noradrenaline transporter
Synonyms:
Monoamine transporter NET Noradrenaline Transporter (NET) Norepinephrine transporter protein (NET) SLC6A2 Sodium-dependent noradrenaline transporter (NET) | Solute carrier family 6 member 2
Type:
Multi-pass membrane protein
Mol. Mass.:
69337.72
Organism:
Homo sapiens (Human)
Description:
P23975
Residue:
617
  
Inhibitor
Name:
BDBM50209172
Synonyms:
(S)-3-(4-(dimethylamino)cyclohex-1-enyl)-1H-indole-5-carbonitrile | CHEMBL234705
Type:
Small organic molecule
Emp. Form.:
C17H19N3
Mol. Mass.:
265.3529
SMILES:
CN(C)[C@H]1CCC(=CC1)c1c[nH]c2ccc(cc12)C#N
: