Target
B1 bradykinin receptor
Ligand
BDBM50209737
Substrate
Meas. Tech.
ChEMBL_434360 (CHEMBL919419)
Ki
40.6±n/a nM
Citation
 Biswas, KLi, AChen, JJD'Amico, DCFotsch, CHan, NHuman, JLiu, QNorman, MHRiahi, BYuan, CSuzuki, HMareska, DAZhan, JClarke, DEToro, AGroneberg, RDBurgess, LELester-Zeiner, DBiddlecome, GManning, BHArik, LDong, HHuang, MKamassah, ALoeloff, RSun, HHsieh, FYKumar, GNg, GYHungate, RWAskew, BCJohnson, E Potent nonpeptide antagonists of the bradykinin B1 receptor: structure-activity relationship studies with novel diaminochroman carboxamides. J Med Chem 50:2200-12 (2007)  
Target
Name:
B1 bradykinin receptor
Synonyms:
B1 BRADYKININ B1R BK-1 receptor BRADYB1 | Bradykinin B1 receptor
Type:
Enzyme
Mol. Mass.:
40508.87
Organism:
Homo sapiens (Human)
Description:
P46663
Residue:
353
  
Inhibitor
Name:
BDBM50209737
Synonyms:
(R)-N-((R)-7-((tert-butylamino)methyl)chroman-4-yl)-3-(3-chloro-2-methylphenylsulfonamido)-3-phenylpropanamide | CHEMBL390603
Type:
Small organic molecule
Emp. Form.:
C30H36ClN3O4S
Mol. Mass.:
570.143
SMILES:
Cc1c(Cl)cccc1S(=O)(=O)N[C@H](CC(=O)N[C@@H]1CCOc2cc(CNC(C)(C)C)ccc12)c1ccccc1
: