Target
B1 bradykinin receptor
Ligand
BDBM50209738
Substrate
Meas. Tech.
ChEMBL_434360 (CHEMBL919419)
Ki
6.7±n/a nM
Citation
 Biswas, KLi, AChen, JJD'Amico, DCFotsch, CHan, NHuman, JLiu, QNorman, MHRiahi, BYuan, CSuzuki, HMareska, DAZhan, JClarke, DEToro, AGroneberg, RDBurgess, LELester-Zeiner, DBiddlecome, GManning, BHArik, LDong, HHuang, MKamassah, ALoeloff, RSun, HHsieh, FYKumar, GNg, GYHungate, RWAskew, BCJohnson, E Potent nonpeptide antagonists of the bradykinin B1 receptor: structure-activity relationship studies with novel diaminochroman carboxamides. J Med Chem 50:2200-12 (2007)  
Target
Name:
B1 bradykinin receptor
Synonyms:
B1 BRADYKININ B1R BK-1 receptor BRADYB1 | Bradykinin B1 receptor
Type:
Enzyme
Mol. Mass.:
40508.87
Organism:
Homo sapiens (Human)
Description:
P46663
Residue:
353
  
Inhibitor
Name:
BDBM50209738
Synonyms:
(R)-3-(3,4-dichlorophenylsulfonamido)-3-(4-fluorophenyl)-N-((R)-7-((2-methoxyethylamino)methyl)chroman-4-yl)propanamide | CHEMBL227655
Type:
Small organic molecule
Emp. Form.:
C28H30Cl2FN3O5S
Mol. Mass.:
610.524
SMILES:
COCCNCc1ccc2[C@@H](CCOc2c1)NC(=O)C[C@@H](NS(=O)(=O)c1ccc(Cl)c(Cl)c1)c1ccc(F)cc1
: