Target
5-hydroxytryptamine receptor 2A
Ligand
BDBM50210093
Substrate
Meas. Tech.
ChEMBL_443936 (CHEMBL893102)
IC50
0.31±n/a nM
Citation
 Feng, ZMohapatra, SKlimko, PGHellberg, MRMay, JAKelly, CWilliams, GMcLaughlin, MASharif, NA Novel benzodifuran analogs as potent 5-HT2A receptor agonists with ocular hypotensive activity. Bioorg Med Chem Lett 17:2998-3002 (2007)  
Target
Name:
5-hydroxytryptamine receptor 2A
Synonyms:
5-HT-2A 5-HT2A 5-hydroxytryptamine receptor 2A (5HT2A) Htr2 Serotonin Receptor 2A
Type:
G Protein-Coupled Receptor (GPCR)
Mol. Mass.:
52852.05
Organism:
Rattus norvegicus (rat)
Description:
Rat cortex membranes 5-HT2A receptors.
Residue:
471
  
Inhibitor
Name:
BDBM50210093
Synonyms:
CHEMBL393077 | [8-((R)-2-amino-propyl)-benzo[1,2-b;4,5-b']difuran-4-yl]-methanol
Type:
Small organic molecule
Emp. Form.:
C14H15NO3
Mol. Mass.:
245.2738
SMILES:
C[C@@H](N)Cc1c2ccoc2c(CO)c2ccoc12
: