Target
Glycogen phosphorylase, liver form
Ligand
BDBM50211296
Substrate
Meas. Tech.
ChEMBL_444271 (CHEMBL894512)
Ki
4200±n/a nM
Citation
 Juhász, LDocsa, TBrunyászki, AGergely, PAntus, S Synthesis and glycogen phosphorylase inhibitor activity of 2,3-dihydrobenzo[1,4]dioxin derivatives. Bioorg Med Chem 15:4048-56 (2007)  
Target
Name:
Glycogen phosphorylase, liver form
Synonyms:
Glycogen Phosphorylase (PYGL) Liver glycogen phosphorylase PYGL_HUMAN
Type:
Homodimer
Mol. Mass.:
97153.98
Organism:
Homo sapiens (Human)
Description:
Dimers associate into a tetramer to form the enzymatically active phosphorylase A.
Residue:
847
  
Inhibitor
Name:
BDBM50211296
Synonyms:
(7R,8S,9S,10R)-8,9,10-trihydroxy-7-hydroxymethyl-6-oxa-1,3-diaza-spiro[4.5]decane-2,4-dione | CHEMBL396576
Type:
Small organic molecule
Emp. Form.:
C8H12N2O7
Mol. Mass.:
248.1901
SMILES:
OC[C@H]1OC2(NC(=O)NC2=O)[C@H](O)[C@@H](O)[C@@H]1O
: