Target
Protein tyrosine phosphatase receptor type C-associated protein
Ligand
BDBM50212333
Substrate
Meas. Tech.
ChEMBL_436619 (CHEMBL904929)
IC50
1200±n/a nM
Citation
 Dawson, MIXia, ZLiu, GYe, MFontana, JAFarhana, LPatel, BBArumugarajah, SBhuiyan, MZhang, XKHan, YHStallcup, WBFukushi, JMustelin, TTautz, LSu, YHarris, DLWaleh, NHobbs, PDJong, LChao, WRSchiff, LJSani, BP An adamantyl-substituted retinoid-derived molecule that inhibits cancer cell growth and angiogenesis by inducing apoptosis and binds to small heterodimer partner nuclear receptor: effects of modifying its carboxylate group on apoptosis, proliferation, and protein-tyrosine phosphatase activity. J Med Chem 50:2622-39 (2007)  
Target
Name:
Protein tyrosine phosphatase receptor type C-associated protein
Synonyms:
CD45-AP LPAP PTCA_HUMAN PTPRCAP
Type:
PROTEIN
Mol. Mass.:
21182.08
Organism:
Homo sapiens (Human)
Description:
ChEMBL_210870
Residue:
206
  
Inhibitor
Name:
BDBM50212333
Synonyms:
5-[3'-(1-adamantyl)-2-chloro-4'-hydroxy-4-biphenyl]-1H-tetrazole | CHEMBL227622
Type:
Small organic molecule
Emp. Form.:
C23H23ClN4O
Mol. Mass.:
406.908
SMILES:
Oc1ccc(cc1C12CC3CC(CC(C3)C1)C2)-c1ccc(cc1Cl)-c1nnn[nH]1
: