Target
Beta-3 adrenergic receptor
Ligand
BDBM50214245
Substrate
Meas. Tech.
ChEMBL_456291 (CHEMBL888301)
Ki
24±n/a nM
Citation
 Washburn, WNHarper, TWWu, GGodfrey, JDMcCann, PGirotra, RShao, CZhang, HGavai, AMikkilineni, ADejneka, TAhmed, SCaringal, YHangeland, JZhang, MCheng, PTRussell, ADSkwish, SSlusarchyk, DAAllen, GTFrohlich, BHAbboa-Offei, BECap, MWaldron, TLGeorge, RJTesfamariam, BDickinson, KESeymour, AASher, PM Arylpropanolamines: selective beta3 agonists arising from strategies to mitigate phase I metabolic transformations. Bioorg Med Chem Lett 17:4290-6 (2007)  
Target
Name:
Beta-3 adrenergic receptor
Synonyms:
ADRB3 ADRB3_HUMAN Beta-2 adrenergic receptor and beta-3 adrenergic receptor Beta-3 adrenoreceptor | adrenergic Beta3
Type:
G Protein-Coupled Receptor (GPCR)
Mol. Mass.:
43534.88
Organism:
Homo sapiens (Human)
Description:
Residue:
408
  
Inhibitor
Name:
BDBM50214245
Synonyms:
CHEMBL429665 | N-(5-((S)-3-((R)-2-(4-chlorophenyl)-1-(3,4-dimethoxyphenyl)ethylamino)-2-hydroxypropyl)-2-hydroxyphenyl)methanesulfonamide
Type:
Small organic molecule
Emp. Form.:
C26H31ClN2O6S
Mol. Mass.:
535.052
SMILES:
COc1ccc(cc1OC)[C@@H](Cc1ccc(Cl)cc1)NC[C@@H](O)Cc1ccc(O)c(NS(C)(=O)=O)c1
: