Target
3-hydroxy-3-methylglutaryl-coenzyme A reductase
Ligand
BDBM50215684
Substrate
Meas. Tech.
ChEMBL_456534 (CHEMBL922900)
IC50
0.8±n/a nM
Citation
 Pfefferkorn, JASong, YSun, KLMiller, SRTrivedi, BKChoi, CSorenson, RJBratton, LDUnangst, PCLarsen, SDPoel, TJCheng, XMLee, CErasga, NAuerbach, BAskew, VDillon, LHanselman, JCLin, ZLu, GRobertson, AOlsen, KMertz, TSekerke, CPavlovsky, AHarris, MSBainbridge, GCaspers, NChen, HEberstadt, M Design and synthesis of hepatoselective, pyrrole-based HMG-CoA reductase inhibitors. Bioorg Med Chem Lett 17:4538-44 (2007)  
Target
Name:
3-hydroxy-3-methylglutaryl-coenzyme A reductase
Synonyms:
3-hydroxy-3-methylglutaryl-coenzyme A (HMG-CoA) reductase HMDH_HUMAN HMG-CoA reductase (HMGR) | HMGCR
Type:
Enzyme
Mol. Mass.:
97477.10
Organism:
Homo sapiens (Human)
Description:
P04035
Residue:
888
  
Inhibitor
Name:
BDBM50215684
Synonyms:
CHEMBL398240 | sodium (3R,5R)-7-(3-(4-fluorophenyl)-1-isopropyl-4-phenyl-5-((pyridin-2-ylmethyl)carbamoyl)-1H-pyrrol-2-yl)-3,5-dihydroxyheptanoate
Type:
Small organic molecule
Emp. Form.:
C33H35FN3O5
Mol. Mass.:
572.6471
SMILES:
CC(C)n1c(CC[C@@H](O)C[C@@H](O)CC([O-])=O)c(c(c1C(=O)NCc1ccccn1)-c1ccccc1)-c1ccc(F)cc1
: