Target
Alpha-2C adrenergic receptor
Ligand
BDBM50218115
Substrate
Meas. Tech.
ChEMBL_444831 (CHEMBL895082)
EC50
10.0±n/a nM
Citation
 Crassous, PACardinaletti, CCarrieri, ABruni, BDi Vaira, MGentili, FGhelfi, FGiannella, MParis, HPiergentili, AQuaglia, WSchaak, SVesprini, CPigini, M Alpha2-adrenoreceptors profile modulation. 3.1 (R)-(+)-m-nitrobiphenyline, a new efficient and alpha2C-subtype selective agonist. J Med Chem 50:3964-8 (2007)  
Target
Name:
Alpha-2C adrenergic receptor
Synonyms:
ADA2C_HUMAN ADRA2L2 Adrenergic alpha2C Adrenergic receptor alpha Alpha-2 adrenergic receptor subtype C4 Alpha-2C adrenoreceptor | adrenergic, alpha-2C-, receptor [Homo sapiens]
Type:
Enzyme
Mol. Mass.:
49552.32
Organism:
Homo sapiens (Human)
Description:
P18825
Residue:
462
  
Inhibitor
Name:
BDBM50218115
Synonyms:
(R)-2-[1-(3'-nitrobiphenyl-2-yloxy)ethyl]-4,5-dihydro-1H-imidazole | CHEMBL242693
Type:
Small organic molecule
Emp. Form.:
C17H17N3O3
Mol. Mass.:
311.3352
SMILES:
C[C@@H](Oc1ccccc1-c1cccc(c1)[N+]([O-])=O)C1=NCCN1
: