Target
Cholinesterase
Ligand
BDBM50218507
Substrate
Meas. Tech.
ChEMBL_444936 (CHEMBL894086)
IC50
>0.000±n/a nM
Comments
modified from >0.000010
Citation
 Piazzi, LCavalli, ABelluti, FBisi, AGobbi, SRizzo, SBartolini, MAndrisano, VRecanatini, MRampa, A Extensive SAR and computational studies of 3-{4-[(benzylmethylamino)methyl]phenyl}-6,7-dimethoxy-2H-2-chromenone (AP2238) derivatives. J Med Chem 50:4250-4 (2007)  
Target
Name:
Cholinesterase
Synonyms:
Acylcholine acylhydrolase Butyrylcholine esterase (BChE) Butyrylcholinesterase (BuChE) CHLE_HUMAN Cholinesterases Pseudocholinesterase
Type:
Homotetramer
Mol. Mass.:
68422.27
Organism:
Homo sapiens (Human)
Description:
P06276
Residue:
602
  
Inhibitor
Name:
BDBM50218507
Synonyms:
6,7-dimethoxy-3-(4-{[(3-nitrobenzyl)methylamino]methyl}phenyl)-chromen-2-one | CHEMBL242905
Type:
Small organic molecule
Emp. Form.:
C26H24N2O6
Mol. Mass.:
460.4786
SMILES:
COc1cc2cc(-c3ccc(CN(C)Cc4cccc(c4)[N+]([O-])=O)cc3)c(=O)oc2cc1OC
: