Target
Potassium voltage-gated channel subfamily H member 2
Ligand
BDBM50220232
Substrate
Meas. Tech.
ChEMBL_449179 (CHEMBL899444)
Ki
>30000±n/a nM
Citation
 Hamblett, CLMethot, JLMampreian, DMSloman, DLStanton, MGKral, AMFleming, JCCruz, JCChenard, MOzerova, NHitz, AMWang, HDeshmukh, SVNazef, NHarsch, AHughes, BDahlberg, WKSzewczak, AAMiddleton, REMosley, RTSecrist, JPMiller, TA The discovery of 6-amino nicotinamides as potent and selective histone deacetylase inhibitors. Bioorg Med Chem Lett 17:5300-9 (2007)  
Target
Name:
Potassium voltage-gated channel subfamily H member 2
Synonyms:
1,3-beta-glucan synthase component GLS2 ERG Eag-related protein 1 Ether-a-go-go-related gene (HERG) Ether-a-go-go-related gene potassium channel 1 Ether-a-go-go-related gene potassium channel 1 (hERG1) Ether-a-go-go-related protein 1 H-ERG KCNH2 Potassium voltage-gated channel subfamily H member 2 (hERG) Voltage-gated potassium channel subunit Kv11.1 hERG Potassium Channel 1 | putative potassium channel subunit
Type:
Multi-pass membrane protein
Mol. Mass.:
126672.65
Organism:
Homo sapiens (Human)
Description:
Q12809
Residue:
1159
  
Inhibitor
Name:
BDBM50220232
Synonyms:
(S)-benzyl 4-(5-((2-aminophenyl)carbamoyl)pyridin-2-yl)-2-methylpiperazine-1-carboxylate CHEMBL236902
Type:
Small organic molecule
Emp. Form.:
C25H27N5O3
Mol. Mass.:
445.5136
SMILES:
C[C@H]1CN(CCN1C(=O)OCc1ccccc1)c1ccc(cn1)C(=O)Nc1ccccc1N
: