Target
Hydroxycarboxylic acid receptor 2
Ligand
BDBM50220853
Substrate
Meas. Tech.
ChEMBL_449367 (CHEMBL899634)
EC50
>1000±n/a nM
Citation
 Skinner, PJCherrier, MCWebb, PJShin, YJGharbaoui, TLindstrom, AHong, VTamura, SYDang, HTPride, CCChen, RRichman, JGConnolly, DTSemple, G Fluorinated pyrazole acids are agonists of the high affinity niacin receptor GPR109a. Bioorg Med Chem Lett 17:5620-3 (2007)  
Target
Name:
Hydroxycarboxylic acid receptor 2
Synonyms:
G-protein coupled receptor 109A GPR109A HCAR2 HM74A NIACR1 Nicotinic acid receptor 1
Type:
G Protein-Coupled Receptor (GPCR)
Mol. Mass.:
41868.22
Organism:
Homo sapiens (Human)
Description:
Membranes from CHO cells expressing the recombinant human GPR109A were used in competition binding assay.
Residue:
363
  
Inhibitor
Name:
BDBM50220853
Synonyms:
5-(5-cyclopropyl-1H-pyrazol-3-yl)-1H-tetrazole | CHEMBL235230
Type:
Small organic molecule
Emp. Form.:
C7H8N6
Mol. Mass.:
176.1786
SMILES:
C1CC1c1cc(n[nH]1)-c1nnn[nH]1
: