Target
Hydroxycarboxylic acid receptor 2
Ligand
BDBM50132132
Substrate
Meas. Tech.
ChEMBL_449367 (CHEMBL899634)
EC50
>1000±n/a nM
Citation
 Skinner, PJCherrier, MCWebb, PJShin, YJGharbaoui, TLindstrom, AHong, VTamura, SYDang, HTPride, CCChen, RRichman, JGConnolly, DTSemple, G Fluorinated pyrazole acids are agonists of the high affinity niacin receptor GPR109a. Bioorg Med Chem Lett 17:5620-3 (2007)  
Target
Name:
Hydroxycarboxylic acid receptor 2
Synonyms:
G-protein coupled receptor 109A GPR109A HCAR2 HM74A NIACR1 Nicotinic acid receptor 1
Type:
G Protein-Coupled Receptor (GPCR)
Mol. Mass.:
41868.22
Organism:
Homo sapiens (Human)
Description:
Membranes from CHO cells expressing the recombinant human GPR109A were used in competition binding assay.
Residue:
363
  
Inhibitor
Name:
BDBM50132132
Synonyms:
1H-pyrazole-3-carboxylic acid | CHEMBL128679
Type:
Small organic molecule
Emp. Form.:
C4H4N2O2
Mol. Mass.:
112.0868
SMILES:
OC(=O)c1ccn[nH]1
: