Target
Beta-1 adrenergic receptor
Ligand
BDBM50019443
Substrate
Meas. Tech.
ChEMBL_449388 (CHEMBL899646)
Ki
0.52±n/a nM
Citation
 Krushinski, JHSchaus, JMThompson, DCCalligaro, DONelson, DLLuecke, SHWainscott, DBWong, DT Indoloxypropanolamine analogues as 5-HT(1A) receptor antagonists. Bioorg Med Chem Lett 17:5600-4 (2007)  
Target
Name:
Beta-1 adrenergic receptor
Synonyms:
ADRB1 ADRB1_HUMAN Beta-1 adrenoceptor | adrenergic Beta1
Type:
G Protein-Coupled Receptor (GPCR)
Mol. Mass.:
51338.40
Organism:
Homo sapiens (Human)
Description:
P08588
Residue:
477
  
Inhibitor
Name:
BDBM50019443
Synonyms:
1-(1H-Indol-4-yloxy)-3-isopropylamino-propan-2-ol 1-(1H-Indol-4-yloxy)-3-isopropylamino-propan-2-ol(pindolol) LB-46 PINDOLOL,(-) VISKAZIDE | VISKEN
Type:
Small organic molecule
Emp. Form.:
C14H20N2O2
Mol. Mass.:
248.3208
SMILES:
CC(C)NCC(O)COc1cccc2[nH]ccc12
: