Target
Aldo-keto reductase family 1 member B1
Ligand
BDBM16429
Substrate
Meas. Tech.
ChEMBL_457959 (CHEMBL924228)
IC50
4400±n/a nM
Citation
 Ferrari, AMDegliesposti, GSgobba, MRastelli, G Validation of an automated procedure for the prediction of relative free energies of binding on a set of aldose reductase inhibitors. Bioorg Med Chem 15:7865-77 (2007)  
Target
Name:
Aldo-keto reductase family 1 member B1
Synonyms:
AKR1B1 ALDR_HUMAN AR Aldose Reductase (ALR2) Aldose reductase (AR)
Type:
Protein
Mol. Mass.:
35855.50
Organism:
Homo sapiens (Human)
Description:
P15121. 4LAU; 2IKI; 4LB4; 2FZD; 2FZ8; 1US0
Residue:
316
  
Inhibitor
Name:
BDBM16429
Synonyms:
2,6-Dichlorophenylacetic acid CHEMBL240293 | EINECS 229-504-0
Type:
Small organic molecule
Emp. Form.:
C8H6Cl2O2
Mol. Mass.:
205.038
SMILES:
OC(=O)Cc1c(Cl)cccc1Cl
: