Target
Oxysterols receptor LXR-beta
Ligand
BDBM50227159
Substrate
Meas. Tech.
ChEMBL_461472 (CHEMBL927483)
IC50
4±n/a nM
Citation
 Hu, BQuinet, EUnwalla, RCollini, MJetter, JDooley, RAndraka, DNogle, LSavio, DHalpern, AGoos-Nilsson, AWilhelmsson, ANambi, PWrobel, J Carboxylic acid based quinolines as liver X receptor modulators that have LXRbeta receptor binding selectivity. Bioorg Med Chem Lett 18:54-9 (2008)  
Target
Name:
Oxysterols receptor LXR-beta
Synonyms:
LXRB Liver X, LXR beta NR1H2 Nuclear receptor NER Ubiquitously-expressed nuclear receptor
Type:
Enzyme Catalytic Domain
Mol. Mass.:
50978.79
Organism:
Homo sapiens (Human)
Description:
P55055
Residue:
460
  
Inhibitor
Name:
BDBM50227159
Synonyms:
2-(4-(3-(3-benzyl-8-(trifluoromethyl)quinolin-4-yl)benzylamino)-2,3-dimethylphenyl)acetic acid | CHEMBL253521
Type:
Small organic molecule
Emp. Form.:
C34H29F3N2O2
Mol. Mass.:
554.6015
SMILES:
Cc1c(C)c(NCc2cccc(c2)-c2c(Cc3ccccc3)cnc3c(cccc23)C(F)(F)F)ccc1CC(O)=O
: