Target
Stromelysin-1
Ligand
BDBM50227723
Substrate
Meas. Tech.
ChEMBL_459991 (CHEMBL944034)
IC50
0.400000±n/a nM
Citation
 Whitlock, GADack, KNDickinson, RPLewis, ML A novel series of highly selective inhibitors of MMP-3. Bioorg Med Chem Lett 17:6750-3 (2008)  
Target
Name:
Stromelysin-1
Synonyms:
MMP-3 MMP3_HUMAN Matrix metalloproteinase 3 Matrix metalloproteinase-3 (MMP-3) SL-1 Stromelysin 1 | Transin-1
Type:
Enzyme
Mol. Mass.:
53973.13
Organism:
Homo sapiens (Human)
Description:
P08254
Residue:
477
  
Inhibitor
Name:
BDBM50227723
Synonyms:
2-{4-[3'-(2-amino-ethoxy)-2-methyl-biphenyl-4-yl]-piperidine-1-sulfonyl}-N-hydroxy-2-methyl-propionamide | CHEMBL251918
Type:
Small organic molecule
Emp. Form.:
C24H33N3O5S
Mol. Mass.:
475.601
SMILES:
Cc1cc(ccc1-c1cccc(OCCN)c1)C1CCN(CC1)S(=O)(=O)C(C)(C)C(=O)NO
: