Target
Stromelysin-1
Ligand
BDBM50227725
Substrate
Meas. Tech.
ChEMBL_459991 (CHEMBL944034)
IC50
1±n/a nM
Citation
 Whitlock, GADack, KNDickinson, RPLewis, ML A novel series of highly selective inhibitors of MMP-3. Bioorg Med Chem Lett 17:6750-3 (2008)  
Target
Name:
Stromelysin-1
Synonyms:
MMP-3 MMP3_HUMAN Matrix metalloproteinase 3 Matrix metalloproteinase-3 (MMP-3) SL-1 Stromelysin 1 | Transin-1
Type:
Enzyme
Mol. Mass.:
53973.13
Organism:
Homo sapiens (Human)
Description:
P08254
Residue:
477
  
Inhibitor
Name:
BDBM50227725
Synonyms:
2-{4-[3'-(2-dimethylamino-ethoxy)-2-methyl-biphenyl-4-yl]-piperidine-1-sulfonyl}-N-hydroxy-2-methyl-propionamide | CHEMBL252117
Type:
Small organic molecule
Emp. Form.:
C26H37N3O5S
Mol. Mass.:
503.654
SMILES:
CN(C)CCOc1cccc(c1)-c1ccc(cc1C)C1CCN(CC1)S(=O)(=O)C(C)(C)C(=O)NO
: