Target
1-phosphatidylinositol 4,5-bisphosphate phosphodiesterase gamma-1
Ligand
BDBM50259927
Substrate
Meas. Tech.
ChEMBL_549443 (CHEMBL1019374)
IC50
95020±n/a nM
Citation
 Lee, JSCho, YSPark, EJKim, JOh, WKLee, HSAhn, JS Phospholipase Cgamma1 inhibitory principles from the sarcotestas of Ginkgo biloba. J Nat Prod 61:867-71 (1998)  
Target
Name:
1-phosphatidylinositol 4,5-bisphosphate phosphodiesterase gamma-1
Synonyms:
1-phosphatidylinositol-4,5-bisphosphate phosphodiesterase gamma-1 PLCG1_BOVIN
Type:
PROTEIN
Mol. Mass.:
148298.56
Organism:
Bos taurus
Description:
ChEMBL_549444
Residue:
1291
  
Inhibitor
Name:
BDBM50259927
Synonyms:
3-[10'(Z)-heptadecenyl]phenol | CHEMBL470127
Type:
Small organic molecule
Emp. Form.:
C23H38O
Mol. Mass.:
330.5472
SMILES:
CCCCCC\C=C/CCCCCCCCCc1cccc(O)c1
: