Target
Epidermal growth factor receptor
Ligand
BDBM23446
Substrate
Meas. Tech.
ChEMBL_526697 (CHEMBL970971)
IC50
25000000±n/a nM
Citation
 McArdle, BMCampitelli, MRQuinn, RJ A common protein fold topology shared by flavonoid biosynthetic enzymes and therapeutic targets. J Nat Prod 69:14-7 (2006)  
Target
Name:
Epidermal growth factor receptor
Synonyms:
EGF Receptor Substrate EGFR_HUMAN ERBB1 Epidermal Growth Factor Receptor erbB-1 Epidermal growth factor receptor (EGFR) HER1 Proto-oncogene c-ErbB-1 Tyrosine-Protein Kinase ErbB-1
Type:
Receptor Kinase Domain
Mol. Mass.:
134279.59
Organism:
Homo sapiens (Human)
Description:
P00533
Residue:
1210
  
Inhibitor
Name:
BDBM23446
Synonyms:
3-(4-hydroxyphenyl)-1-(2,4,6-trihydroxyphenyl)propan-1-one Phloretin | cid_4788
Type:
Dihydrochalcone
Emp. Form.:
C15H14O5
Mol. Mass.:
274.2687
SMILES:
Oc1ccc(CCC(=O)c2c(O)cc(O)cc2O)cc1
: