Target
Aromatase
Ligand
BDBM50240347
Substrate
Meas. Tech.
ChEMBL_524646 (CHEMBL976710)
IC50
44200±n/a nM
Citation
 Balunas, MJSu, BLandini, SBrueggemeier, RWKinghorn, AD Interference by naturally occurring fatty acids in a noncellular enzyme-based aromatase bioassay. J Nat Prod 69:700-3 (2006)  
Target
Name:
Aromatase
Synonyms:
ARO1 CP19A_HUMAN CYP19 CYPXIX Cytochrome P450 19A1 Cytochrome P450-C19 (CYP19) FL cytokine receptor precursor | P-450AROM
Type:
Enzyme
Mol. Mass.:
57888.92
Organism:
Homo sapiens (Human)
Description:
P11511
Residue:
503
  
Inhibitor
Name:
BDBM50240347
Synonyms:
(9,12,15)-linolenic acid (Z,Z,Z)-9,12,15-octadecatrienoic acid ALA all-cis-9,12,15-octadecatrienoic acid cid_5280934 cis-Delta(9,12,15)-octadecatrienoic acid | linolenic acid
Type:
Small organic molecule
Emp. Form.:
C18H30O2
Mol. Mass.:
278.4296
SMILES:
CC\C=C/C\C=C/C\C=C/CCCCCCCC(O)=O
: