Target
D(2) dopamine receptor
Ligand
BDBM29644
Substrate
Meas. Tech.
ChEMBL_529942 (CHEMBL975013)
Ki
48±n/a nM
Citation
 Sipos, AKiss, BSchmidt, EGreiner, IBerényi, S Synthesis and neuropharmacological evaluation of 2-aryl- and alkylapomorphines. Bioorg Med Chem 16:3773-9 (2008)  
Target
Name:
D(2) dopamine receptor
Synonyms:
DOPAMINE D2 DOPAMINE D2 Short Dopamine D2 receptor Drd2
Type:
G Protein-Coupled Receptor (GPCR)
Mol. Mass.:
50931.60
Organism:
Rattus norvegicus (rat)
Description:
P61169
Residue:
444
  
Inhibitor
Name:
BDBM29644
Synonyms:
(6aR)-6-methyl-5,6,6a,7-tetrahydro-4H-dibenzo[de,g]quinoline-10,11-diol;hydrate;hydrochloride APOMORPHINE HYDROCHLORIDE HEMIHYDRATE SMR000059235 | cid_6852399
Type:
Small organic molecule
Emp. Form.:
C17H17NO2
Mol. Mass.:
267.3224
SMILES:
CN1CCc2cccc-3c2[C@H]1Cc1ccc(O)c(O)c-31
: