Target
D(3) dopamine receptor
Ligand
BDBM29644
Substrate
Meas. Tech.
ChEMBL_529941 (CHEMBL975012)
Ki
36±n/a nM
Citation
 Sipos, AKiss, BSchmidt, EGreiner, IBerényi, S Synthesis and neuropharmacological evaluation of 2-aryl- and alkylapomorphines. Bioorg Med Chem 16:3773-9 (2008)  
Target
Name:
D(3) dopamine receptor
Synonyms:
DOPAMINE D3 Dopamine D3 receptor | Drd3
Type:
Protein
Mol. Mass.:
49540.58
Organism:
Rattus norvegicus (Rat)
Description:
P19020
Residue:
446
  
Inhibitor
Name:
BDBM29644
Synonyms:
(6aR)-6-methyl-5,6,6a,7-tetrahydro-4H-dibenzo[de,g]quinoline-10,11-diol;hydrate;hydrochloride APOMORPHINE HYDROCHLORIDE HEMIHYDRATE SMR000059235 | cid_6852399
Type:
Small organic molecule
Emp. Form.:
C17H17NO2
Mol. Mass.:
267.3224
SMILES:
CN1CCc2cccc-3c2[C@H]1Cc1ccc(O)c(O)c-31
: