Target
D(2) dopamine receptor
Ligand
BDBM50251320
Substrate
Meas. Tech.
ChEMBL_533452 (CHEMBL986944)
EC50
55±n/a nM
Citation
 Sipos, ACsutorás, CBerényi, SUustare, ARinken, A Synthesis and neuropharmacological characterization of 2-O-substituted apomorphines. Bioorg Med Chem 16:4563-8 (2008)  
Target
Name:
D(2) dopamine receptor
Synonyms:
DOPAMINE D2 DOPAMINE D2 Short Dopamine D2 receptor Drd2
Type:
G Protein-Coupled Receptor (GPCR)
Mol. Mass.:
50931.60
Organism:
Rattus norvegicus (rat)
Description:
P61169
Residue:
444
  
Inhibitor
Name:
BDBM50251320
Synonyms:
(R)-2-Ethoxy-6-methyl-5,6,6a,7-tetrahydro-4H-dibenzo[de,g]quinoline-10,11-diol | CHEMBL465055
Type:
Small organic molecule
Emp. Form.:
C19H21NO3
Mol. Mass.:
311.3749
SMILES:
CCOc1cc2CCN(C)[C@@H]3Cc4ccc(O)c(O)c4-c(c1)c23
: