Target
Alpha-1A adrenergic receptor
Ligand
BDBM50029257
Substrate
Meas. Tech.
ChEMBL_530289 (CHEMBL979556)
Ki
0.02±n/a nM
Citation
 Jain, KSBariwal, JBKathiravan, MKPhoujdar, MSSahne, RSChauhan, BSShah, AKYadav, MR Recent advances in selective alpha1-adrenoreceptor antagonists as antihypertensive agents. Bioorg Med Chem 16:4759-800 (2008)  
Target
Name:
Alpha-1A adrenergic receptor
Synonyms:
ADA1A_HUMAN ADRA1C Alpha 1A-adrenoceptor Alpha adrenergic receptor 1a Alpha-adrenergic receptor 1c adrenergic Alpha1 | adrenergic Alpha1C
Type:
Cell-surface receptors
Mol. Mass.:
51511.67
Organism:
Homo sapiens (Human)
Description:
P35348
Residue:
466
  
Inhibitor
Name:
BDBM50029257
Synonyms:
(3-((4-(2-isopropoxyphenyl)piperazin-1-yl)methyl)phenyl)(piperidin-1-yl)methanone RWJ-377796 {3-[4-(2-Isopropoxy-phenyl)-piperazin-1-ylmethyl]-phenyl}-piperidin-1-yl-methanone
Type:
Small organic molecule
Emp. Form.:
C26H35N3O2
Mol. Mass.:
421.575
SMILES:
CC(C)Oc1ccccc1N1CCN(Cc2cccc(c2)C(=O)N2CCCCC2)CC1
: