Target
Sodium channel protein type 10 subunit alpha
Ligand
BDBM50117271
Substrate
Meas. Tech.
ChEMBL_552562 (CHEMBL954006)
IC50
31000±n/a nM
Citation
 Drizin, IGregg, RJScanio, MJShi, LGross, MFAtkinson, RNThomas, JBJohnson, MSCarroll, WAMarron, BEChapman, MLLiu, DKrambis, MJShieh, CCZhang, XHernandez, GGauvin, DMMikusa, JPZhu, CZJoshi, SHonore, PMarsh, KCRoeloffs, RWerness, SKrafte, DSJarvis, MFFaltynek, CRKort, ME Discovery of potent furan piperazine sodium channel blockers for treatment of neuropathic pain. Bioorg Med Chem 16:6379-86 (2008)  
Target
Name:
Sodium channel protein type 10 subunit alpha
Synonyms:
SCNAA_RAT Sns Sodium channel protein type X alpha subunit | Voltage-gated sodium channel subunit alpha Nav1.8
Type:
Enzyme
Mol. Mass.:
219724.17
Organism:
Rattus norvegicus (Rat)
Description:
Q62968
Residue:
1956
  
Inhibitor
Name:
BDBM50117271
Synonyms:
1-(2,6-dimethylphenoxy)-2-propanolamine 2-(2,6-Dimethyl-phenoxy)-1-methyl-ethylamine CHEMBL558 Mexitil
Type:
Small organic molecule
Emp. Form.:
C11H17NO
Mol. Mass.:
179.2588
SMILES:
CC(N)COc1c(C)cccc1C
: