Target
5-hydroxytryptamine receptor 1D
Ligand
BDBM50240412
Substrate
Meas. Tech.
ChEMBL_552732 (CHEMBL965238)
IC50
0.050000±n/a nM
Citation
 Choi, SKGreen, DHo, AKlein, UMarquess, DTaylor, RTurner, SD Designing selective, high affinity ligands of 5-HT1D receptor by covalent dimerization of 5-HT1F ligands derived from 4-fluoro-N-[3-(1-methyl-4-piperidinyl)-1H-indol-5-yl]benzamide. J Med Chem 51:3609-16 (2008)  
Target
Name:
5-hydroxytryptamine receptor 1D
Synonyms:
5-HT-1D 5-HT1D 5HT1D_HUMAN HTR1DA Serotonin (5-HT) receptor | Serotonin Receptor 1D
Type:
G Protein-Coupled Receptor (GPCR)
Mol. Mass.:
41920.63
Organism:
Homo sapiens (Human)
Description:
Receptor binding assays were performed using human clone stably expressed in CHO cells.
Residue:
377
  
Inhibitor
Name:
BDBM50240412
Synonyms:
3-(4-{7-[4-(5-carbamoyl-1H-3-indolyl)-3-cyclohexenylamino]heptylamino}-1-cyclohexenyl)-1H-5-indolecarboxamide | CHEMBL22744
Type:
Small organic molecule
Emp. Form.:
C37H46N6O2
Mol. Mass.:
606.8001
SMILES:
NC(=O)c1ccc2[nH]cc(C3=CCC(CC3)NCCCCCCCNC3CCC(=CC3)c3c[nH]c4ccc(cc34)C(N)=O)c2c1
: