Target
Gamma-aminobutyric acid receptor subunit rho-1
Ligand
BDBM50032982
Substrate
Meas. Tech.
ChEMBL_554600 (CHEMBL964514)
IC50
62000±n/a nM
Citation
 Kumar, RJChebib, MHibbs, DEKim, HLJohnston, GASalam, NKHanrahan, JR Novel gamma-aminobutyric acid rho1 receptor antagonists; synthesis, pharmacological activity and structure-activity relationships. J Med Chem 51:3825-40 (2008)  
Target
Name:
Gamma-aminobutyric acid receptor subunit rho-1
Synonyms:
GABA receptor rho-1 subunit GABRR1 | GBRR1_HUMAN
Type:
PROTEIN
Mol. Mass.:
55892.34
Organism:
Homo sapiens (Human)
Description:
ChEMBL_1456653
Residue:
479
  
Inhibitor
Name:
BDBM50032982
Synonyms:
(3-Amino-propyl)-butyl-phosphinic acid CGP36742 | CHEMBL112797
Type:
Small organic molecule
Emp. Form.:
C7H18NO2P
Mol. Mass.:
179.1971
SMILES:
CCCCP(O)(=O)CCCN
: