Target
Serine/threonine-protein kinase Chk1
Ligand
BDBM50243261
Substrate
Meas. Tech.
ChEMBL_491561 (CHEMBL944207)
IC50
11±n/a nM
Citation
 Janetka, JWAlmeida, LAshwell, SBrassil, PJDaly, KDeng, CGero, TGlynn, REHorn, CLIoannidis, SLyne, PNewcombe, NJOza, VBPass, MSpringer, SKSu, MToader, DVasbinder, MMYu, DYu, YZabludoff, SD Discovery of a novel class of 2-ureido thiophene carboxamide checkpoint kinase inhibitors. Bioorg Med Chem Lett 18:4242-8 (2008)  
Target
Name:
Serine/threonine-protein kinase Chk1
Synonyms:
CHEK1 CHK1 checkpoint homolog Checkpoint kinase-1 (CHK1)
Type:
Enzyme Catalytic Domain
Mol. Mass.:
54443.02
Organism:
Homo sapiens (Human)
Description:
gi_166295192
Residue:
476
  
Inhibitor
Name:
BDBM50243261
Synonyms:
(S)-1-(3-(piperidin-3-ylcarbamoyl)-5-(4-(piperidine-1-carbonyl)phenyl)thiophen-2-yl)urea | CHEMBL486234
Type:
Small organic molecule
Emp. Form.:
C23H29N5O3S
Mol. Mass.:
455.573
SMILES:
NC(=O)Nc1sc(cc1C(=O)N[C@H]1CCCNC1)-c1ccc(cc1)C(=O)N1CCCCC1
: