Target
Serine/threonine-protein kinase Chk1
Ligand
BDBM50242823
Substrate
Meas. Tech.
ChEMBL_491561 (CHEMBL944207)
IC50
11±n/a nM
Citation
 Janetka, JWAlmeida, LAshwell, SBrassil, PJDaly, KDeng, CGero, TGlynn, REHorn, CLIoannidis, SLyne, PNewcombe, NJOza, VBPass, MSpringer, SKSu, MToader, DVasbinder, MMYu, DYu, YZabludoff, SD Discovery of a novel class of 2-ureido thiophene carboxamide checkpoint kinase inhibitors. Bioorg Med Chem Lett 18:4242-8 (2008)  
Target
Name:
Serine/threonine-protein kinase Chk1
Synonyms:
CHEK1 CHK1 checkpoint homolog Checkpoint kinase-1 (CHK1)
Type:
Enzyme Catalytic Domain
Mol. Mass.:
54443.02
Organism:
Homo sapiens (Human)
Description:
gi_166295192
Residue:
476
  
Inhibitor
Name:
BDBM50242823
Synonyms:
1-(3-((S)-piperidin-3-ylcarbamoyl)-5-(3-fluorophenyl)thiophen-2-yl)urea CHEMBL517553
Type:
Small organic molecule
Emp. Form.:
C17H19FN4O2S
Mol. Mass.:
362.422
SMILES:
NC(=O)Nc1sc(cc1C(=O)N[C@H]1CCCNC1)-c1cccc(F)c1
: