Target
Sodium-dependent noradrenaline transporter
Ligand
BDBM50243503
Substrate
Meas. Tech.
ChEMBL_487421 (CHEMBL1020015)
Ki
17±n/a nM
Citation
 Mahaney, PEGavrin, LKTrybulski, EJStack, GPVu, TACohn, STYe, FBelardi, JKSantilli, AASabatucci, JPLeiter, JJohnston, GHBray, JABurroughs, KDCosmi, SALeventhal, LKoury, EJZhang, YMugford, CAHo, DMRosenzweig-Lipson, SJPlatt, BSmith, VADeecher, DC Structure-activity relationships of the cycloalkanol ethylamine scaffold: discovery of selective norepinephrine reuptake inhibitors. J Med Chem 51:4038-49 (2008)  
Target
Name:
Sodium-dependent noradrenaline transporter
Synonyms:
Monoamine transporter NET Noradrenaline Transporter (NET) Norepinephrine transporter protein (NET) SLC6A2 Sodium-dependent noradrenaline transporter (NET) | Solute carrier family 6 member 2
Type:
Multi-pass membrane protein
Mol. Mass.:
69337.72
Organism:
Homo sapiens (Human)
Description:
P23975
Residue:
617
  
Inhibitor
Name:
BDBM50243503
Synonyms:
(+)-1-[(1S)-1-(3-Chlorophenyl)-2-piperazin-1-ylethyl]cyclohexanol Dihydrochloride | CHEMBL461707
Type:
Small organic molecule
Emp. Form.:
C18H27ClN2O
Mol. Mass.:
322.873
SMILES:
OC1(CCCCC1)[C@H](CN1CCNCC1)c1cccc(Cl)c1
: