Target
Trace amine-associated receptor 1
Ligand
BDBM50022723
Substrate
Meas. Tech.
ChEMBL_489239 (CHEMBL989986)
EC50
935±n/a nM
Citation
 Lewin, AHNavarro, HAMascarella, SW Structure-activity correlations for beta-phenethylamines at human trace amine receptor 1. Bioorg Med Chem 16:7415-23 (2008)  
Target
Name:
Trace amine-associated receptor 1
Synonyms:
TA1 TAAR1_HUMAN TRAR1 | trace amine-associated receptor 1
Type:
PROTEIN
Mol. Mass.:
39107.47
Organism:
Homo sapiens (Human)
Description:
ChEMBL_792734
Residue:
339
  
Inhibitor
Name:
BDBM50022723
Synonyms:
(+)-(S)-amphetamine (+)-alpha-methylphenylethylamine (S)-(+)-amphetamine (S)-1-phenyl-2-aminopropane (S)-alpha-methylbenzeneethanamine (alphaS)-alpha-methylbenzeneethanamine Dextroamphetamine dexamphetamine
Type:
Small organic molecule
Emp. Form.:
C9H13N
Mol. Mass.:
135.2062
SMILES:
C[C@H](N)Cc1ccccc1
: