Target
Glutamate receptor ionotropic, NMDA 1
Ligand
BDBM50062599
Substrate
Meas. Tech.
ChEMBL_489454 (CHEMBL982936)
IC50
9520±n/a nM
Citation
 Rosini, MSimoni, EBartolini, MCavalli, ACeccarini, LPascu, NMcClymont, DWTarozzi, ABolognesi, MLMinarini, ATumiatti, VAndrisano, VMellor, IRMelchiorre, C Inhibition of acetylcholinesterase, beta-amyloid aggregation, and NMDA receptors in Alzheimer's disease: a promising direction for the multi-target-directed ligands gold rush. J Med Chem 51:4381-4 (2008)  
Target
Name:
Glutamate receptor ionotropic, NMDA 1
Synonyms:
GRIN1 Glutamate [NMDA] receptor subunit zeta-1 N-methyl-D-aspartate receptor subunit NR1 NMDZ1_HUMAN | phencyclidine
Type:
Enzyme Catalytic Domain
Mol. Mass.:
105397.81
Organism:
Homo sapiens (Human)
Description:
Q05586
Residue:
938
  
Inhibitor
Name:
BDBM50062599
Synonyms:
3,5-Dimethyl-adamantan-1-ylamine EN300-123026 Namenda | US10214478, Compound memantine
Type:
Small organic molecule
Emp. Form.:
C12H21N
Mol. Mass.:
179.3018
SMILES:
CC12CC3CC(C)(C1)CC(N)(C3)C2
: