Target
Amine oxidase [flavin-containing] B
Ligand
BDBM50261814
Substrate
Meas. Tech.
ChEMBL_514664 (CHEMBL975558)
IC50
19000±n/a nM
Citation
 Hruschka, SRosen, TCYoshida, SKirk, KLFröhlich, RWibbeling, BHaufe, G Fluorinated phenylcyclopropylamines. Part 5: Effects of electron-withdrawing or -donating aryl substituents on the inhibition of monoamine oxidases A and B by 2-aryl-2-fluoro-cyclopropylamines. Bioorg Med Chem 16:7148-66 (2008)  
Target
Name:
Amine oxidase [flavin-containing] B
Synonyms:
AOFB_HUMAN MAOB Monoamine oxidase type B (MAO B) Monoamine oxidase type B (MAOB)
Type:
Protein
Mol. Mass.:
58768.76
Organism:
Homo sapiens (Human)
Description:
P27338
Residue:
520
  
Inhibitor
Name:
BDBM50261814
Synonyms:
CHEMBL467794 | cis-2-phenylcyclopropylamine
Type:
Small organic molecule
Emp. Form.:
C9H11N
Mol. Mass.:
133.1903
SMILES:
N[C@@H]1C[C@@H]1c1ccccc1
: