Target
Leukotriene A-4 hydrolase
Ligand
BDBM50272060
Substrate
Meas. Tech.
ChEMBL_510221 (CHEMBL1004837)
IC50
3600±n/a nM
Citation
 Enomoto, HMorikawa, YMiyake, YTsuji, FMizuchi, MSuhara, HFujimura, KHoriuchi, MBan, M Synthesis and biological evaluation of N-mercaptoacylproline and N-mercaptoacylthiazolidine-4-carboxylic acid derivatives as leukotriene A4 hydrolase inhibitors. Bioorg Med Chem Lett 18:4529-32 (2008)  
Target
Name:
Leukotriene A-4 hydrolase
Synonyms:
LKHA4_CAVPO | LTA4H
Type:
PROTEIN
Mol. Mass.:
68972.78
Organism:
Cavia porcellus
Description:
ChEMBL_544515
Residue:
611
  
Inhibitor
Name:
BDBM50272060
Synonyms:
(2S,5S)-5-(benzylthio)-1-((S)-3-mercapto-2-methylpropanoyl)pyrrolidine-2-carboxylic acid | CHEMBL498798
Type:
Small organic molecule
Emp. Form.:
C16H21NO3S2
Mol. Mass.:
339.473
SMILES:
C[C@H](CS)C(=O)N1[C@H](CC[C@H]1C(O)=O)SCc1ccccc1
: