Target
Macrophage colony-stimulating factor 1 receptor
Ligand
BDBM50244780
Substrate
Meas. Tech.
ChEMBL_512118 (CHEMBL980054)
IC50
7±n/a nM
Citation
 Scott, DAAquila, BMBebernitz, GACook, DJDakin, LADeegan, TLHattersley, MMIoannidis, SLyne, PDOmer, CAYe, MZheng, X Pyridyl and thiazolyl bisamide CSF-1R inhibitors for the treatment of cancer. Bioorg Med Chem Lett 18:4794-7 (2008)  
Target
Name:
Macrophage colony-stimulating factor 1 receptor
Synonyms:
CSF1R FMS Macrophage colony stimulating factor receptor Macrophage colony-stimulating factor 1 receptor (c-FMS) Proto-oncogene c-Fms c-fms | cFMS
Type:
Protein
Mol. Mass.:
107979.48
Organism:
Homo sapiens (Human)
Description:
P07333
Residue:
972
  
Inhibitor
Name:
BDBM50244780
Synonyms:
5-(3-Chloro-benzoylamino)-2-methyl-N-(2-methyl-thiazol-5-yl)-benzamide | CHEMBL462130
Type:
Small organic molecule
Emp. Form.:
C19H16ClN3O2S
Mol. Mass.:
385.867
SMILES:
Cc1ncc(NC(=O)c2cc(NC(=O)c3cccc(Cl)c3)ccc2C)s1
: