Target
Macrophage colony-stimulating factor 1 receptor
Ligand
BDBM50244782
Substrate
Meas. Tech.
ChEMBL_512118 (CHEMBL980054)
IC50
5±n/a nM
Citation
 Scott, DAAquila, BMBebernitz, GACook, DJDakin, LADeegan, TLHattersley, MMIoannidis, SLyne, PDOmer, CAYe, MZheng, X Pyridyl and thiazolyl bisamide CSF-1R inhibitors for the treatment of cancer. Bioorg Med Chem Lett 18:4794-7 (2008)  
Target
Name:
Macrophage colony-stimulating factor 1 receptor
Synonyms:
CSF1R FMS Macrophage colony stimulating factor receptor Macrophage colony-stimulating factor 1 receptor (c-FMS) Proto-oncogene c-Fms c-fms | cFMS
Type:
Protein
Mol. Mass.:
107979.48
Organism:
Homo sapiens (Human)
Description:
P07333
Residue:
972
  
Inhibitor
Name:
BDBM50244782
Synonyms:
2-Chloro-5-(3-chloro-benzoylamino)-N-thiazol-5-yl-benzamide | CHEMBL461572
Type:
Small organic molecule
Emp. Form.:
C17H11Cl2N3O2S
Mol. Mass.:
392.259
SMILES:
Clc1cccc(c1)C(=O)Nc1ccc(Cl)c(c1)C(=O)Nc1cncs1
: