Target
Prostaglandin G/H synthase 1
Ligand
BDBM50016799
Substrate
Meas. Tech.
ChEMBL_511542 (CHEMBL980985)
IC50
10300±n/a nM
Citation
 Biava, MPorretta, GCPoce, GSupino, SManetti, FForli, SBotta, MSautebin, LRossi, APergola, CGhelardini, CNorcini, MMakovec, FGiordani, AAnzellotti, PCirilli, RFerretti, RGallinella, BLa Torre, FAnzini, MPatrignani, P Synthesis, in vitro, and in vivo biological evaluation and molecular docking simulations of chiral alcohol and ether derivatives of the 1,5-diarylpyrrole scaffold as novel anti-inflammatory and analgesic agents. Bioorg Med Chem 16:8072-81 (2008)  
Target
Name:
Prostaglandin G/H synthase 1
Synonyms:
COX-1 Cyclooxygenase Cyclooxygenase-1 (COX-1) PTGS1 | Prostaglandin G/H synthase (cyclooxygenase)
Type:
Enzyme
Mol. Mass.:
68692.62
Organism:
Homo sapiens (Human)
Description:
P23219
Residue:
599
  
Inhibitor
Name:
BDBM50016799
Synonyms:
(1,8-Diethyl-1,3,4,9-tetrahydro-pyrano[3,4-b]indol-1-yl)-acetic acid AY-24236 ETODOLAC Lodine | Lodine xl
Type:
Small organic molecule
Emp. Form.:
C17H21NO3
Mol. Mass.:
287.3535
SMILES:
CCc1cccc2c3CCOC(CC)(CC(O)=O)c3[nH]c12
: