Target
Integrin alpha-L
Ligand
BDBM50263711
Substrate
Meas. Tech.
ChEMBL_535592 (CHEMBL987066)
IC50
1.4±n/a nM
Citation
 Guckian, KMLin, EYSilvian, LFriedman, JEChin, DScott, DM Design and synthesis of a series of meta aniline-based LFA-1 ICAM inhibitors. Bioorg Med Chem Lett 18:5249-51 (2008)  
Target
Name:
Integrin alpha-L
Synonyms:
CD11 antigen-like family member A CD_antigen=CD11a ITGAL LFA-1A Leukocyte adhesion glycoprotein LFA-1 alpha chain | Leukocyte function-associated molecule 1 alpha chain
Type:
PROTEIN
Mol. Mass.:
128748.90
Organism:
Homo sapiens (Human)
Description:
ChEMBL_629045
Residue:
1170
  
Inhibitor
Name:
BDBM50263711
Synonyms:
(E)-1-morpholino-3-(4-(3-(piperidin-4-ylamino)phenylthio)-2,3-bis(trifluoromethyl)phenyl)prop-2-en-1-one | CHEMBL491402
Type:
Small organic molecule
Emp. Form.:
C26H27F6N3O2S
Mol. Mass.:
559.567
SMILES:
FC(F)(F)c1c(Sc2cccc(NC3CCNCC3)c2)ccc(\C=C\C(=O)N2CCOCC2)c1C(F)(F)F
: