Target
Integrin alpha-L
Ligand
BDBM50263755
Substrate
Meas. Tech.
ChEMBL_535592 (CHEMBL987066)
IC50
0.5±n/a nM
Citation
 Guckian, KMLin, EYSilvian, LFriedman, JEChin, DScott, DM Design and synthesis of a series of meta aniline-based LFA-1 ICAM inhibitors. Bioorg Med Chem Lett 18:5249-51 (2008)  
Target
Name:
Integrin alpha-L
Synonyms:
CD11 antigen-like family member A CD_antigen=CD11a ITGAL LFA-1A Leukocyte adhesion glycoprotein LFA-1 alpha chain | Leukocyte function-associated molecule 1 alpha chain
Type:
PROTEIN
Mol. Mass.:
128748.90
Organism:
Homo sapiens (Human)
Description:
ChEMBL_629045
Residue:
1170
  
Inhibitor
Name:
BDBM50263755
Synonyms:
(E)-3-(4-(3-(1-methylpiperidin-4-ylamino)phenylthio)-2,3-bis(trifluoromethyl)phenyl)-1-morpholinoprop-2-en-1-one | CHEMBL520731
Type:
Small organic molecule
Emp. Form.:
C27H29F6N3O2S
Mol. Mass.:
573.593
SMILES:
CN1CCC(CC1)Nc1cccc(Sc2ccc(\C=C\C(=O)N3CCOCC3)c(c2C(F)(F)F)C(F)(F)F)c1
: