Target
Integrin alpha-L
Ligand
BDBM50265149
Substrate
Meas. Tech.
ChEMBL_497066 (CHEMBL997702)
IC50
2.5±n/a nM
Citation
 Lin, EYGuckian, KMSilvian, LChin, DBoriack-Sjodin, PAvan Vlijmen, HFriedman, JEScott, DM Structure-activity relationship of ortho- and meta-phenol based LFA-1 ICAM inhibitors. Bioorg Med Chem Lett 18:5245-8 (2008)  
Target
Name:
Integrin alpha-L
Synonyms:
CD11 antigen-like family member A CD_antigen=CD11a ITGAL LFA-1A Leukocyte adhesion glycoprotein LFA-1 alpha chain | Leukocyte function-associated molecule 1 alpha chain
Type:
PROTEIN
Mol. Mass.:
128748.90
Organism:
Homo sapiens (Human)
Description:
ChEMBL_629045
Residue:
1170
  
Inhibitor
Name:
BDBM50265149
Synonyms:
(E)-1-morpholino-3-(4-(2-(tetrahydro-2H-pyran-4-yloxy)phenylthio)-2,3-bis(trifluoromethyl)phenyl)prop-2-en-1-one | CHEMBL497978
Type:
Small organic molecule
Emp. Form.:
C26H25F6NO4S
Mol. Mass.:
561.536
SMILES:
FC(F)(F)c1c(Sc2ccccc2OC2CCOCC2)ccc(\C=C\C(=O)N2CCOCC2)c1C(F)(F)F
: