Target
Integrin alpha-L
Ligand
BDBM50265285
Substrate
Meas. Tech.
ChEMBL_497066 (CHEMBL997702)
IC50
4±n/a nM
Citation
 Lin, EYGuckian, KMSilvian, LChin, DBoriack-Sjodin, PAvan Vlijmen, HFriedman, JEScott, DM Structure-activity relationship of ortho- and meta-phenol based LFA-1 ICAM inhibitors. Bioorg Med Chem Lett 18:5245-8 (2008)  
Target
Name:
Integrin alpha-L
Synonyms:
CD11 antigen-like family member A CD_antigen=CD11a ITGAL LFA-1A Leukocyte adhesion glycoprotein LFA-1 alpha chain | Leukocyte function-associated molecule 1 alpha chain
Type:
PROTEIN
Mol. Mass.:
128748.90
Organism:
Homo sapiens (Human)
Description:
ChEMBL_629045
Residue:
1170
  
Inhibitor
Name:
BDBM50265285
Synonyms:
(cis)-4-(2-(4-((E)-3-morpholino-3-oxoprop-1-enyl)-2,3-bis(trifluoromethyl)phenylthio)phenoxy)cyclohexanecarboxylic acid | CHEMBL502512
Type:
Small organic molecule
Emp. Form.:
C28H27F6NO5S
Mol. Mass.:
603.573
SMILES:
OC(=O)[C@@H]1CC[C@@H](CC1)Oc1ccccc1Sc1ccc(\C=C\C(=O)N2CCOCC2)c(c1C(F)(F)F)C(F)(F)F
: