Target
Integrin alpha-L
Ligand
BDBM50264878
Substrate
Meas. Tech.
ChEMBL_497066 (CHEMBL997702)
IC50
0.4±n/a nM
Citation
 Lin, EYGuckian, KMSilvian, LChin, DBoriack-Sjodin, PAvan Vlijmen, HFriedman, JEScott, DM Structure-activity relationship of ortho- and meta-phenol based LFA-1 ICAM inhibitors. Bioorg Med Chem Lett 18:5245-8 (2008)  
Target
Name:
Integrin alpha-L
Synonyms:
CD11 antigen-like family member A CD_antigen=CD11a ITGAL LFA-1A Leukocyte adhesion glycoprotein LFA-1 alpha chain | Leukocyte function-associated molecule 1 alpha chain
Type:
PROTEIN
Mol. Mass.:
128748.90
Organism:
Homo sapiens (Human)
Description:
ChEMBL_629045
Residue:
1170
  
Inhibitor
Name:
BDBM50264878
Synonyms:
(cis)-4-((2-(4-((E)-3-morpholino-3-oxoprop-1-enyl)-2,3-bis(trifluoromethyl)phenylthio)phenoxy)methyl)cyclohexanecarboxylic acid cis-4-{[2-({4-[(1E)-3-morpholin-4-yl-3-oxoprop-1-en-1-yl]-2,3-bis(trifluoromethyl)phenyl}sulfanyl)phenoxy]methyl}cyclohexanecarboxylic acid
Type:
Small organic molecule
Emp. Form.:
C29H29F6NO5S
Mol. Mass.:
617.6
SMILES:
OC(=O)[C@@H]1CC[C@H](COc2ccccc2Sc2ccc(\C=C\C(=O)N3CCOCC3)c(c2C(F)(F)F)C(F)(F)F)CC1
: