Target
A disintegrin and metalloproteinase with thrombospondin motifs 5
Ligand
BDBM50265114
Substrate
Meas. Tech.
ChEMBL_492653 (CHEMBL953082)
Ki
1900±n/a nM
Citation
 Georgiadis, DYiotakis, A Specific targeting of metzincin family members with small-molecule inhibitors: progress toward a multifarious challenge. Bioorg Med Chem 16:8781-94 (2008)  
Target
Name:
A disintegrin and metalloproteinase with thrombospondin motifs 5
Synonyms:
A disintegrin and metalloproteinase with thrombospondin motifs 5 (ADAMTS-5) ADAMTS5 ATS5_HUMAN Metalloproteinase with thrombospondin motifs 5 (ADAMTS-5)
Type:
Enzyme
Mol. Mass.:
101769.09
Organism:
Homo sapiens (Human)
Description:
Q9UNA0
Residue:
930
  
Inhibitor
Name:
BDBM50265114
Synonyms:
CHEMBL495502 | N-((2R,6S)-4-(2-(hydroxyamino)-2-oxoethyl)-2,6-dimethylpiperidin-4-yl)-4-((2-methylquinolin-4-yl)methoxy)benzamide
Type:
Small organic molecule
Emp. Form.:
C27H32N4O4
Mol. Mass.:
476.5674
SMILES:
C[C@H]1C[C@](CC(=O)NO)(C[C@@H](C)N1)NC(=O)c1ccc(OCc2cc(C)nc3ccccc23)cc1
: