Target
Disintegrin and metalloproteinase domain-containing protein 17
Ligand
BDBM26526
Substrate
Meas. Tech.
ChEMBL_492682 (CHEMBL953112)
Ki
0.560000±n/a nM
Citation
 Georgiadis, DYiotakis, A Specific targeting of metzincin family members with small-molecule inhibitors: progress toward a multifarious challenge. Bioorg Med Chem 16:8781-94 (2008)  
Target
Name:
Disintegrin and metalloproteinase domain-containing protein 17
Synonyms:
A disintegrin and metalloproteinase domain 17 ADAM 17 Snake venom-like protease TNF-alpha-Converting Enzyme
Type:
Metalloprotease
Mol. Mass.:
12197.99
Organism:
Sus scrofa (pig)
Description:
Partially purified TACE was obtained from porcine spleen.
Residue:
112
  
Inhibitor
Name:
BDBM26526
Synonyms:
(2R)-N-hydroxy-2-[(3S)-3-methyl-3-{4-[(2-methylquinolin-4-yl)methoxy]phenyl}-2-oxopyrrolidin-1-yl]propanamide CHEMBL148169 | IK682
Type:
Small organic molecule
Emp. Form.:
C25H27N3O4
Mol. Mass.:
433.4996
SMILES:
C[C@@H](N1CC[C@](C)(C1=O)c1ccc(OCc2cc(C)nc3ccccc23)cc1)C(=O)NO
: